Reaction Details
TargetD(4) dopamine receptor
LigandBDBM84449
Substrate/Competitorn/a
Meas. Tech.Binding Assay
Ki 3.7±0.0 nM
Citation Hendrix, JAShimshock, SJShutske, GMTomer, JDKapples, KJPalermo, MGCorbett, TJVargas, HMKafka, SBrooks, KMLaws-Ricker, LLee, DKde Lannoy, IBordeleau, MRizkalla, GOwolabi, JKamboj, RK Synthesis and structure-activity relationship of the isoindolinyl benzisoxazolpiperidines as potent, selective, and orally active human dopamine D4 receptor antagonists. Chembiochem3:999-1009 (2002) 
 
D(4) dopamine receptor
Name:D(4) dopamine receptor
Type:Enzyme
Mol. Mass.:48373.19
Organism:Homo sapiens (Human)
Description:P21917
Residue:419
BDBM84449
NameBDBM84449
Synonyms:Isoindoline, 16
TypeSmall organic molecule
Emp. Form.C24H28FN3O2
Mol. Mass.409.4964
SMILESCc1cccc2CN(CC(CO)N3CCC(CC3)c3noc4cc(F)ccc34)Cc12