Reaction Details
TargetD(2) dopamine receptor
LigandBDBM84443
Substrate/Competitorn/a
Meas. Tech.Binding Assay
Ki 100±0.0 nM
Citation Hendrix, JAShimshock, SJShutske, GMTomer, JDKapples, KJPalermo, MGCorbett, TJVargas, HMKafka, SBrooks, KMLaws-Ricker, LLee, DKde Lannoy, IBordeleau, MRizkalla, GOwolabi, JKamboj, RK Synthesis and structure-activity relationship of the isoindolinyl benzisoxazolpiperidines as potent, selective, and orally active human dopamine D4 receptor antagonists. Chembiochem3:999-1009 (2002) 
 
D(2) dopamine receptor
Name:D(2) dopamine receptor
Type:Cell-surface receptors
Mol. Mass.:50647.10
Organism:Homo sapiens (Human)
Description:P14416
Residue:443
BDBM84443
NameBDBM84443
Synonyms:Isoindoline, 10 | Isoindoline, 11
TypeSmall organic molecule
Emp. Form.C23H25F2N3O2
Mol. Mass.413.4603
SMILESOCC(CN1Cc2ccc(F)cc2C1)N1CCC(CC1)c1noc2cc(F)ccc12