Reaction Details
TargetAlpha-1B adrenergic receptor
LigandBDBM84453
Substrate/Competitorn/a
Meas. Tech.Binding Assay
Ki 17.5±0.0 nM
Citation Hendrix, JAShimshock, SJShutske, GMTomer, JDKapples, KJPalermo, MGCorbett, TJVargas, HMKafka, SBrooks, KMLaws-Ricker, LLee, DKde Lannoy, IBordeleau, MRizkalla, GOwolabi, JKamboj, RK Synthesis and structure-activity relationship of the isoindolinyl benzisoxazolpiperidines as potent, selective, and orally active human dopamine D4 receptor antagonists. Chembiochem3:999-1009 (2002) 
 
Alpha-1B adrenergic receptor
Name:Alpha-1B adrenergic receptor
Type:G Protein-Coupled Receptor (GPCR)
Mol. Mass.:56606.71
Organism:Rattus norvegicus (rat)
Description:Receptor binding assays were performed using rat cortical membranes.
Residue:515
BDBM84453
NameBDBM84453
Synonyms:Isoindoline, 20
TypeSmall organic molecule
Emp. Form.C24H28FN3O3
Mol. Mass.425.4958
SMILESCOc1cccc2CN(CC(CO)N3CCC(CC3)c3noc4cc(F)ccc34)Cc12