Reaction Details
TargetGag-Pol polyprotein [489-587,G537V,H558K,V571A]
LigandBDBM84461
Substrate/Competitorn/a
Meas. Tech.Inhibiton Activity Assay
Ki 4±0.5 nM
IC50 13±0.5 nM
Citation Brik, AMuldoon, JLin, YCElder, JHGoodsell, DSOlson, AJFokin, VVSharpless, KBWong, CH Rapid diversity-oriented synthesis in microtiter plates for in situ screening of HIV protease inhibitors. Chembiochem4:1246-8 (2003) 
 
Gag-Pol polyprotein [489-587,G537V,H558K,V571A]
Name:Gag-Pol polyprotein [489-587,G537V,H558K,V571A]
Type:Protein
Mol. Mass.:10827.77
Organism:Human immunodeficiency virus
Description:P12497[489-587,G537V,H558K,V571A]
Residue:99
BDBM84461
NameBDBM84461
Synonyms:HIV-1 PR Inhibitor, compound 8
TypeSmall organic molecule
Emp. Form.C37H48N6O7S
Mol. Mass.720.878
SMILESCOc1ccc(cc1)S(=O)(=O)N(CC(C)C)C[C@@H](O)[C@H](Cc1ccccc1)n1cc(CNC(=O)c2ccc(CNC(=O)OC(C)(C)C)cc2)nn1