Reaction Details
TargetCyclin-dependent kinase 1
LigandBDBM84533
Substrate/Competitorn/a
Meas. Tech.Kinase Assay
pH7.5±0
Temperature303.15±0 K
IC50 0.23±0.0 nM
Citation Kunick, CZeng, ZGussio, RZaharevitz, DLeost, MTotzke, FSchächtele, CKubbutat, MHMeijer, LLemcke, T Structure-aided optimization of kinase inhibitors derived from alsterpaullone. Chembiochem6:541-9 (2005) 
 
Cyclin-dependent kinase 1
Name:Cyclin-dependent kinase 1
Type:Enzyme Subunit
Mol. Mass.:34101.08
Organism:Homo sapiens (Human)
Description:P06493
Residue:297
BDBM84533
NameBDBM84533
Synonyms:Alsterpaullone derivative, 7 | BDBM50375663
TypeSmall organic molecule
Emp. Form.C19H14N4O3
Mol. Mass.346.3395
SMILES[O-][N+](=O)c1ccc2[nH]c-3c(CC(=O)Nc4ccc(CCC#N)cc-34)c2c1