Reaction Details
TargetKit ligand
LigandBDBM84553
Substrate/Competitorn/a
Meas. Tech.Inhibition Assay
pH7±0
Temperature295.15±0 K
IC50>1.0e+4±n/a nM
Citation Jautelat, RBrumby, TSchäfer, MBriem, HEisenbrand, GSchwahn, SKrüger, MLücking, UPrien, OSiemeister, G From the insoluble dye indirubin towards highly active, soluble CDK2-inhibitors. Chembiochem6:531-40 (2005) 
 
Kit ligand
Name:Kit ligand
Type:Protein
Mol. Mass.:30897.20
Organism:Homo sapiens (Human)
Description:P21583
Residue:273
BDBM84553
NameBDBM84553
Synonyms:Indirubin derivative, 28a | Indirubin derivative, 28b
TypeSmall organic molecule
Emp. Form.C22H26N4O4S
Mol. Mass.442.531
SMILESCN(C)CCN(C)S(=O)(=O)c1ccc2NC(=O)C(C3=Nc4ccccc4C3(C)O)c2c1