Reaction Details
TargetFibroblast growth factor 2
LigandBDBM84567
Substrate/Competitorn/a
Meas. Tech.Binding Assay
pH7.4±0
Kd 108±7 nM
Citation Cochran, SLi, CPBytheway, I An experimental and molecular-modeling study of the binding of linked sulfated tetracyclitols to FGF-1 and FGF-2. Chembiochem6:1882-90 (2005) 
 
Fibroblast growth factor 2
Name:Fibroblast growth factor 2
Type:Protein
Mol. Mass.:30803.89
Organism:Homo sapiens (Human)
Description:P09038
Residue:288
BDBM84567
NameBDBM84567
Synonyms:Linked sulfated tetracyclitol, 8
TypeSmall organic molecule
Emp. Form.C32H40N2O48S12
Mol. Mass.1605.431
SMILES[O-]S(=O)(=O)O[C@@H]1C=C[C@@H]([C@@H](OS([O-])(=O)=O)[C@@H]1OS([O-])(=O)=O)N(CCCCCCCCN([C@H]1C=C[C@@H](OS([O-])(=O)=O)[C@@H](OS([O-])(=O)=O)[C@@H]1OS([O-])(=O)=O)[C@H]1C=C[C@@H](OS([O-])(=O)=O)[C@@H](OS([O-])(=O)=O)[C@@H]1OS([O-])(=O)=O)[C@H]1C=C[C@@H](OS([O-])(=O)=O)[C@@H](OS([O-])(=O)=O)[C@@H]1OS([O-])(=O)=O