Reaction Details
TargetThymidylate synthase
LigandBDBM36701
Substrate/Competitorn/a
Meas. Tech.Inhibition Assay
Ki 2.5e+3±n/a nM
Citation Calò, STondi, DFerrari, SVenturelli, AGhelli, SCosti, MP Constrained dansyl derivatives reveal bacterial specificity of highly conserved thymidylate synthases. Chembiochem9:779-90 (2008) 
 
Thymidylate synthase
Name:Thymidylate synthase
Type:Enzyme
Mol. Mass.:36576.54
Organism:Lactobacillus casei
Description:n/a
Residue:316
BDBM36701
NameBDBM36701
Synonyms:Dansyl derivative, 3L | Dansyltyrosine deriviative 19B
TypeSmall organic molecule
Emp. Form.C27H25N3O9S2
Mol. Mass.599.632
SMILESCN(C)c1cccc2c(cccc12)S(=O)(=O)Oc1ccc(C[C@H](NS(=O)(=O)c2ccc(cc2)N(=O)=O)C(O)=O)cc1