Reaction Details
TargetSomatostatin receptor type 1
LigandBDBM84620
Substrate/Competitorn/a
Ki 70.4±n/a nM
CommentsPDSP_627
Citation Patel, YCSrikant, CB Subtype selectivity of peptide analogs for all five cloned human somatostatin receptors (hsstr 1-5). Endocrinology135:2814-7 (1994) 
 
Somatostatin receptor type 1
Name:Somatostatin receptor type 1
Type:Enzyme
Mol. Mass.:42692.81
Organism:Homo sapiens (Human)
Description:P30872
Residue:391
BDBM84620
NameBDBM84620
Synonyms:DC23-60
TypeSmall organic molecule
Emp. Form.C54H70N10O10S2
Mol. Mass.1083.325
SMILESCC(C)C1NC(=O)C(CCCCN)NC(=O)C(Cc2c[nH]c3ccccc23)NC(=O)C(Cc2ccc(O)cc2)NC(=O)C(CSSCC(NC1=O)C(=O)NC(CO)C(C)O)NC(=O)C(N)Cc1cccc2ccccc12