Reaction Details
TargetSomatostatin receptor type 2
LigandBDBM84626
Substrate/Competitorn/a
Ki 2.7±n/a nM
CommentsPDSP_377
Citation Patel, YCSrikant, CB Subtype selectivity of peptide analogs for all five cloned human somatostatin receptors (hsstr 1-5). Endocrinology135:2814-7 (1994) 
 
Somatostatin receptor type 2
Name:Somatostatin receptor type 2
Type:Enzyme
Mol. Mass.:41344.94
Organism:Homo sapiens (Human)
Description:P30874
Residue:369
BDBM84626
NameBDBM84626
Synonyms:BIM 23034
TypeSmall organic molecule
Emp. Form.C55H64N10O8S2
Mol. Mass.1057.289
SMILESCC1NC(=O)C(CCCCN)NC(=O)C(Cc2c[nH]c3ccccc23)NC(=O)C(Cc2ccc(O)cc2)NC(=O)C(CSSCC(NC1=O)C(=O)NCc1cccc2ccccc12)NC(=O)C(N)Cc1ccccc1