Reaction Details
TargetSomatostatin receptor type 3
LigandBDBM84628
Substrate/Competitorn/a
Ki 69±n/a nM
CommentsPDSP_775
Citation Patel, YCSrikant, CB Subtype selectivity of peptide analogs for all five cloned human somatostatin receptors (hsstr 1-5). Endocrinology135:2814-7 (1994) 
 
Somatostatin receptor type 3
Name:Somatostatin receptor type 3
Type:Protein
Mol. Mass.:45855.97
Organism:Homo sapiens (Human)
Description:P32745
Residue:418
BDBM84628
NameBDBM84628
Synonyms:EC5-21
TypeSmall organic molecule
Emp. Form.C56H66N10O8S2
Mol. Mass.1071.315
SMILESCC(O)C1NC(=O)C(CCCCN)NC(=O)C(Cc2c[nH]c3ccccc23)NC(=O)C(Cc2ccccc2)NC(=O)C(CSSCC(NC1=O)C(=O)NCc1cccc2ccccc12)NC(=O)C(N)Cc1ccccc1