Reaction Details
TargetSomatostatin receptor type 5
LigandBDBM82462
Substrate/Competitorn/a
Ki 0.24±n/a nM
CommentsPDSP_388
Citation Patel, YCSrikant, CB Subtype selectivity of peptide analogs for all five cloned human somatostatin receptors (hsstr 1-5). Endocrinology135:2814-7 (1994) 
 
Somatostatin receptor type 5
Name:Somatostatin receptor type 5
Type:Enzyme
Mol. Mass.:39218.02
Organism:Homo sapiens (Human)
Description:P35346
Residue:364
BDBM82462
NameBDBM82462
Synonyms:BIM 23059 | D-Nal-c[Cys-Tyr-D-Trp-Lys-Thr-Cys]-Thr-NH2
TypeSmall organic molecule
Emp. Form.C54H68N12O12S2
Mol. Mass.1141.321
SMILESCC(CO)C(NC(=O)C1NC(=O)N[C@@H](Cc2ccc(O)cc2)C(=O)N[C@H](Cc2c[nH]c3ccccc23)C(=O)N[C@@H](CCCCN)C(=O)N[C@@H](C(C)CO)C(=O)NC(SS1)C(=O)N[C@@H](Cc1ccc2ccccc2c1)C(N)=O)C(N)=O