Reaction Details
TargetD(2) dopamine receptor
LigandBDBM50008735
Substrate/Competitorn/a
Ki 1.1±n/a nM
CommentsPDSP_449
Citation Seeman, PVan Tol, HH Dopamine D4 receptors bind inactive (+)-aporphines, suggesting neuroleptic role. Sulpiride not stereoselective. Eur J Pharmacol233:173-4 (1993) 
 
D(2) dopamine receptor
Name:D(2) dopamine receptor
Type:Cell-surface receptors
Mol. Mass.:50647.10
Organism:Homo sapiens (Human)
Description:P14416
Residue:443
BDBM50008735
NameBDBM50008735
Synonyms:(+)-3-(tert-butyl)-(3S,4aS,13bS)-2,3,4,4a,8,9,13b,14-octahydro-1H-benzo[4,5]cyclohepta[de]pyrido[2,1-a]isoquinolin-3-ol (+/-)-3-(tert-butyl)-(3S,4aS,13bS)-2,3,4,4a,8,9,13b,14-octahydro-1H-benzo[4,5]cyclohepta[de]pyrido[2,1-a]isoquinolin-3-ol 3-(tert-butyl)-(3S,4aS,13bS)-2,3,4,4a,8,9,13b,14-octahydro-1H-benzo[4,5]cyclohepta[de]pyrido[2,1-a]isoquinolin-3-ol 3-(tert-butyl)-(3S,4aS,13bS)-2,3,4,4a,8,9,13b,14-octahydro-1H-benzo[4,5]cyclohepta[de]pyrido[2,1-a]isoquinolin-3-ol((+)-butaclamol) BUTACLAMOL BUTACLAMOL,(+) CHEMBL8514 | d-Butaclamol
TypeSmall organic molecule
Emp. Form.C25H31NO
Mol. Mass.361.5197
SMILESCC(C)(C)[C@]1(O)CCN2C[C@H]3c4ccccc4CCc4cccc([C@@H]2C1)c34