Reaction Details
TargetD(2) dopamine receptor
LigandBDBM84637
Substrate/Competitorn/a
Ki 14±n/a nM
CommentsPDSP_1576
Citation Seeman, PVan Tol, HH Dopamine D4 receptors bind inactive (+)-aporphines, suggesting neuroleptic role. Sulpiride not stereoselective. Eur J Pharmacol233:173-4 (1993) 
 
D(2) dopamine receptor
Name:D(2) dopamine receptor
Type:Cell-surface receptors
Mol. Mass.:50647.10
Organism:Homo sapiens (Human)
Description:P14416
Residue:443
BDBM84637
NameBDBM84637
Synonyms:CAS_85760-74-3 NSC_54562 Quinpirole,(-) | US9359372, Quinpirole
TypeSmall organic molecule
Emp. Form.C13H21N3
Mol. Mass.219.3259
SMILESCCCN1CCC[C@@H]2Cc3[nH]ncc3C[C@@H]12