Reaction Details
TargetSomatostatin receptor type 2
LigandBDBM82455
Substrate/Competitorn/a
Ki 0.001±n/a nM
CommentsPDSP_375
Citation Raynor, KMurphy, WACoy, DHTaylor, JEMoreau, JPYasuda, KBell, GIReisine, T Cloned somatostatin receptors: identification of subtype-selective peptides and demonstration of high affinity binding of linear peptides. Mol Pharmacol43:838-44 (1993) Somatostatin receptor type 2
Name:Somatostatin receptor type 2
Type:Enzyme Catalytic Domain
Mol. Mass.:41234.26
Organism:MOUSE
Description:SOMATOSTATIN SST2 SSTR2 MOUSE::P30875
Residue:369
BDBM82455
NameBDBM82455
Synonyms:BIM 23027 N-Methylcyclo[L-Ala-L-Tyr-D-Trp-L-Lys-L-Abu-L-Phe-]
TypeSmall organic molecule
Emp. Form.C43H54N8O7
Mol. Mass.794.9383
SMILESCC[C@@H]1NC(=O)[C@H](CCCCN)NC(=O)[C@@H](Cc2c[nH]c3ccccc23)NC(=O)[C@H](Cc2ccc(O)cc2)NC(=O)[C@H](C)N(C)C(=O)[C@H](Cc2ccccc2)NC1=O