Reaction Details
TargetSomatostatin receptor type 3
LigandBDBM82470
Substrate/Competitorn/a
Ki 5.6±n/a nM
CommentsPDSP_373
Citation Raynor, KMurphy, WACoy, DHTaylor, JEMoreau, JPYasuda, KBell, GIReisine, T Cloned somatostatin receptors: identification of subtype-selective peptides and demonstration of high affinity binding of linear peptides. Mol Pharmacol43:838-44 (1993) Somatostatin receptor type 3
Name:Somatostatin receptor type 3
Type:Enzyme Catalytic Domain
Mol. Mass.:47225.49
Organism:MOUSE
Description:SOMATOSTATIN SST3 SSTR3 MOUSE::P30935
Residue:428
BDBM82470
NameBDBM82470
Synonyms:3-(2-Naphtyl)-D-Ala-L-Cys(1)-L-Tyr-D-Trp-L-Lys-L-Val-L-Cys(1)-L-Thr-NH2 BIM-23014 | LANREOTIDE
TypeSmall organic molecule
Emp. Form.C54H69N11O10S2
Mol. Mass.1096.323
SMILESCC(C)[C@@H]1NC(=O)[C@H](CCCCN)NC(=O)[C@@H](Cc2c[nH]c3ccccc23)NC(=O)[C@H](Cc2ccc(O)cc2)NC(=O)[C@H](CSSC[C@H](NC1=O)C(=O)N[C@@H]([C@@H](C)O)C(N)=O)NC(=O)[C@H](N)Cc1ccc2ccccc2c1