Reaction Details
TargetSomatostatin receptor type 3
LigandBDBM84626
Substrate/Competitorn/a
Ki 65±n/a nM
CommentsPDSP_377
Citation Raynor, KMurphy, WACoy, DHTaylor, JEMoreau, JPYasuda, KBell, GIReisine, T Cloned somatostatin receptors: identification of subtype-selective peptides and demonstration of high affinity binding of linear peptides. Mol Pharmacol43:838-44 (1993) Somatostatin receptor type 3
Name:Somatostatin receptor type 3
Type:Enzyme Catalytic Domain
Mol. Mass.:47225.49
Organism:MOUSE
Description:SOMATOSTATIN SST3 SSTR3 MOUSE::P30935
Residue:428
BDBM84626
NameBDBM84626
Synonyms:BIM 23034
TypeSmall organic molecule
Emp. Form.C55H64N10O8S2
Mol. Mass.1057.289
SMILESCC1NC(=O)C(CCCCN)NC(=O)C(Cc2c[nH]c3ccccc23)NC(=O)C(Cc2ccc(O)cc2)NC(=O)C(CSSCC(NC1=O)C(=O)NCc1cccc2ccccc12)NC(=O)C(N)Cc1ccccc1