Reaction Details
TargetSomatostatin receptor type 3
LigandBDBM84620
Substrate/Competitorn/a
Ki 166±n/a nM
CommentsPDSP_627
Citation Raynor, KMurphy, WACoy, DHTaylor, JEMoreau, JPYasuda, KBell, GIReisine, T Cloned somatostatin receptors: identification of subtype-selective peptides and demonstration of high affinity binding of linear peptides. Mol Pharmacol43:838-44 (1993) Somatostatin receptor type 3
Name:Somatostatin receptor type 3
Type:Enzyme Catalytic Domain
Mol. Mass.:47225.49
Organism:MOUSE
Description:SOMATOSTATIN SST3 SSTR3 MOUSE::P30935
Residue:428
BDBM84620
NameBDBM84620
Synonyms:DC23-60
TypeSmall organic molecule
Emp. Form.C54H70N10O10S2
Mol. Mass.1083.325
SMILESCC(C)C1NC(=O)C(CCCCN)NC(=O)C(Cc2c[nH]c3ccccc23)NC(=O)C(Cc2ccc(O)cc2)NC(=O)C(CSSCC(NC1=O)C(=O)NC(CO)C(C)O)NC(=O)C(N)Cc1cccc2ccccc12