Reaction Details
TargetSomatostatin receptor type 4
LigandBDBM84616
Substrate/Competitorn/a
Ki 14±n/a nM
CommentsPDSP_396
Citation Raynor, KO'Carroll, AMKong, HYasuda, KMahan, LCBell, GIReisine, T Characterization of cloned somatostatin receptors SSTR4 and SSTR5. Mol Pharmacol44:385-92 (1993) Somatostatin receptor type 4
Name:Somatostatin receptor type 4
Type:Enzyme Catalytic Domain
Mol. Mass.:42096.84
Organism:RAT
Description:SOMATOSTATIN SST4 SSTR4 RAT::P30937
Residue:384
BDBM84616
NameBDBM84616
Synonyms:BIM 23069 L-Alaninamide,4-chloro-D-phenylalanyl-L-alanyl-L-tyrosyl-D-tryptophyl-L-lysyl-L-valyl-L-alanyl-3-(2-naphthalenyl)-(9CI)
Typen/a
Emp. Form.C47H62ClN9O8
Mol. Mass.916.504
SMILESCC(C)[C@H](NC(=O)[C@H](CCCCN)NC(=O)[C@@H](Cc1c[nH]c2ccccc12)NC(=O)[C@H](Cc1ccc(O)cc1)NC(=O)[C@H](C)NC(=O)[C@H](N)Cc1ccc(Cl)cc1)C(=O)N[C@@H](C)C(C)=O