Reaction Details
TargetSomatostatin receptor type 4
LigandBDBM84620
Substrate/Competitorn/a
Ki 1.5±n/a nM
CommentsPDSP_627
Citation Raynor, KO'Carroll, AMKong, HYasuda, KMahan, LCBell, GIReisine, T Characterization of cloned somatostatin receptors SSTR4 and SSTR5. Mol Pharmacol44:385-92 (1993) Somatostatin receptor type 4
Name:Somatostatin receptor type 4
Type:Enzyme Catalytic Domain
Mol. Mass.:42096.84
Organism:RAT
Description:SOMATOSTATIN SST4 SSTR4 RAT::P30937
Residue:384
BDBM84620
NameBDBM84620
Synonyms:DC23-60
TypeSmall organic molecule
Emp. Form.C54H70N10O10S2
Mol. Mass.1083.325
SMILESCC(C)C1NC(=O)C(CCCCN)NC(=O)C(Cc2c[nH]c3ccccc23)NC(=O)C(Cc2ccc(O)cc2)NC(=O)C(CSSCC(NC1=O)C(=O)NC(CO)C(C)O)NC(=O)C(N)Cc1cccc2ccccc12