Reaction Details
TargetSomatostatin receptor type 4
LigandBDBM84641
Substrate/Competitorn/a
Ki 50±n/a nM
CommentsPDSP_1946
Citation Raynor, KO'Carroll, AMKong, HYasuda, KMahan, LCBell, GIReisine, T Characterization of cloned somatostatin receptors SSTR4 and SSTR5. Mol Pharmacol44:385-92 (1993) Somatostatin receptor type 4
Name:Somatostatin receptor type 4
Type:Enzyme Catalytic Domain
Mol. Mass.:42096.84
Organism:RAT
Description:SOMATOSTATIN SST4 SSTR4 RAT::P30937
Residue:384
BDBM84641
NameBDBM84641
Synonyms:SA V | c[Aoc-Phe-D-Trp-Lys-Thr(Bzl)]
TypeSmall organic molecule
Emp. Form.C46H62N8O6
Mol. Mass.823.0345
SMILESCC(OCc1ccccc1)C1NC(=O)C(CCCCCCCCN)NC(=O)C(Cc2ccccc2)NC(=O)C(Cc2c[nH]c3ccccc23)NC(=O)C(CCCN)NC1=O