Reaction Details
TargetD(2) dopamine receptor
LigandBDBM50005120
Substrate/Competitorn/a
Ki 0.03±n/a nM
CommentsPDSP_1981
Citation Tang, LTodd, RDHeller, AO'Malley, KL Pharmacological and functional characterization of D2, D3 and D4 dopamine receptors in fibroblast and dopaminergic cell lines. J Pharmacol Exp Ther268:495-502 (1994) D(2) dopamine receptor
Name:D(2) dopamine receptor
Type:G Protein-Coupled Receptor (GPCR)
Mol. Mass.:50931.60
Organism:Rattus norvegicus (rat)
Description:P61169
Residue:444
BDBM50005120
NameBDBM50005120
Synonyms:CHEMBL274491 N-(1-Benzyl-2-methyl-pyrrolidin-3-yl)-5-chloro-2-methoxy-4-methylamino-benzamide YM-09151-2
TypeSmall organic molecule
Emp. Form.C21H26ClN3O2
Mol. Mass.387.903
SMILESCNc1cc(OC)c(cc1Cl)C(=O)N[C@H]1CCN(Cc2ccccc2)[C@H]1C