Reaction Details
TargetSodium-dependent dopamine transporter
LigandBDBM81946
Substrate/Competitorn/a
Ki 890±n/a nM
CommentsPDSP_1121
Citation Pristupa, ZBWilson, JMHoffman, BJKish, SJNiznik, HB Pharmacological heterogeneity of the cloned and native human dopamine transporter: disassociation of [3H]WIN 35,428 and [3H]GBR 12,935 binding. Mol Pharmacol45:125-35 (1994) Sodium-dependent dopamine transporter
Name:Sodium-dependent dopamine transporter
Type:Multi-pass membrane protein
Mol. Mass.:68497.11
Organism:Homo sapiens (Human)
Description:Q01959
Residue:620
BDBM81946
NameBDBM81946
Synonyms:CAS_96850-13-4 LU 19-005
TypeSmall organic molecule
Emp. Form.C16H15Cl2N
Mol. Mass.292.203
SMILESCN[C@H]1C[C@@H](c2ccccc12)c1ccc(Cl)c(Cl)c1