Reaction Details
Target5-hydroxytryptamine receptor 4
LigandBDBM81781
Substrate/Competitorn/a
Ki 1584.89±n/a nM
CommentsPDSP_155
Citation Grossman, CJKilpatrick, GJBunce, KT Development of a radioligand binding assay for 5-HT4 receptors in guinea-pig and rat brain. Br J Pharmacol109:618-24 (1993) 
 
5-hydroxytryptamine receptor 4
Name:5-hydroxytryptamine receptor 4
Type:Enzyme Catalytic Domain
Mol. Mass.:43735.29
Organism:GUINEA PIG
Description:5-HT4 HTR4 GUINEA PIG::O70528
Residue:388
BDBM81781
NameBDBM81781
Synonyms:5-HT,a-Me | 5-HT,omega-N-Me
Typen/a
Emp. Form.C11H14N2O
Mol. Mass.190.2417
SMILESCn1cc(CCN)c2cc(O)ccc12