Reaction Details
Target5-hydroxytryptamine receptor 4
LigandBDBM48320
Substrate/Competitorn/a
Ki 630.95±n/a nM
CommentsPDSP_1233
Citation Grossman, CJKilpatrick, GJBunce, KT Development of a radioligand binding assay for 5-HT4 receptors in guinea-pig and rat brain. Br J Pharmacol109:618-24 (1993) 
 
5-hydroxytryptamine receptor 4
Name:5-hydroxytryptamine receptor 4
Type:Enzyme Catalytic Domain
Mol. Mass.:43735.29
Organism:GUINEA PIG
Description:5-HT4 HTR4 GUINEA PIG::O70528
Residue:388
BDBM48320
NameBDBM48320
Synonyms:4-amino-5-chloro-N-[2-(diethylamino)ethyl]-2-methoxy-benzamide;hydrochloride 4-azanyl-5-chloranyl-N-[2-(diethylamino)ethyl]-2-methoxy-benzamide;hydrochloride METOCLOPRAMIDE HYDROCHLORIDE Metochloropramide US11147820, Compound Metoclopramide US9132134, Metoclopramide | cid_23659
TypeSmall organic molecule
Emp. Form.C14H22ClN3O2
Mol. Mass.299.796
SMILESCCN(CC)CCNC(=O)c1cc(Cl)c(N)cc1OC