Reaction Details
Target5-hydroxytryptamine receptor 4
LigandBDBM50007871
Substrate/Competitorn/a
Ki 63.09±n/a nM
CommentsPDSP_1919
Citation Grossman, CJKilpatrick, GJBunce, KT Development of a radioligand binding assay for 5-HT4 receptors in guinea-pig and rat brain. Br J Pharmacol109:618-24 (1993) 
 
5-hydroxytryptamine receptor 4
Name:5-hydroxytryptamine receptor 4
Type:Enzyme Catalytic Domain
Mol. Mass.:43735.29
Organism:GUINEA PIG
Description:5-HT4 HTR4 GUINEA PIG::O70528
Residue:388
BDBM50007871
NameBDBM50007871
Synonyms:CHEMBL8197 TROPISETRON
TypeSmall organic molecule
Emp. Form.C17H20N2O2
Mol. Mass.284.3529
SMILESCN1C2CCC1CC(C2)OC(=O)c1c[nH]c2ccccc12