Reaction Details
Target5-hydroxytryptamine receptor 1F
LigandBDBM50014406
Substrate/Competitorn/a
Ki 413±n/a nM
CommentsPDSP_154
Citation Adham, NKao, HTSchecter, LEBard, JOlsen, MUrquhart, DDurkin, MHartig, PRWeinshank, RLBranchek, TA Cloning of another human serotonin receptor (5-HT1F): a fifth 5-HT1 receptor subtype coupled to the inhibition of adenylate cyclase. Proc Natl Acad Sci U S A90:408-12 (1993) 
 
5-hydroxytryptamine receptor 1F
Name:5-hydroxytryptamine receptor 1F
Type:Enzyme Catalytic Domain
Mol. Mass.:41724.68
Organism:Homo sapiens (Human)
Description:5-HT1F HTR1F HUMAN::P30939
Residue:366
BDBM50014406
NameBDBM50014406
Synonyms:2-Me 5-HT 2-methyl-5-HT 3-(2-aminoethyl)-2-methyl-1H-indol-5-ol CHEMBL266591
TypeSmall organic molecule
Emp. Form.C11H14N2O
Mol. Mass.190.2417
SMILESCc1[nH]c2ccc(O)cc2c1CCN