Reaction Details
TargetAurora kinase A
LigandBDBM84651
Substrate/Competitorn/a
Meas. Tech.In Vitro Kinase Assay
pH7.5±0
Temperature277.15±0 K
IC50 52±n/a nM
Citation Sardon, TCottin, TXu, JGiannis, AVernos, I Development and biological evaluation of a novel aurora A kinase inhibitor. Chembiochem10:464-78 (2009) 
 
Aurora kinase A
Name:Aurora kinase A
Type:Serine/threonine-protein kinase
Mol. Mass.:45830.98
Organism:Homo sapiens (Human)
Description:O14965
Residue:403
BDBM84651
NameBDBM84651
Synonyms:TC-107
TypeSmall organic molecule
Emp. Form.C17H14FN3O
Mol. Mass.295.311
SMILESOCC=Cc1ccc2ncnc(Nc3cccc(F)c3)c2c1