Reaction Details
TargetAurora kinase B
LigandBDBM84651
Substrate/Competitorn/a
Meas. Tech.In Vitro Kinase Assay
pH7.5±0
Temperature277.15±0 K
IC50 4.5e+3±n/a nM
Citation Sardon, TCottin, TXu, JGiannis, AVernos, I Development and biological evaluation of a novel aurora A kinase inhibitor. Chembiochem10:464-78 (2009) 
 
Aurora kinase B
Name:Aurora kinase B
Type:Protein
Mol. Mass.:39327.72
Organism:Homo sapiens (Human)
Description:Q96GD4
Residue:344
BDBM84651
NameBDBM84651
Synonyms:TC-107
TypeSmall organic molecule
Emp. Form.C17H14FN3O
Mol. Mass.295.311
SMILESOCC=Cc1ccc2ncnc(Nc3cccc(F)c3)c2c1