Reaction Details
TargetEpidermal growth factor receptor
LigandBDBM84649
Substrate/Competitorn/a
Meas. Tech.In Vitro Kinase Assay
pH7.5±0
Temperature277.15±0 K
IC50>1.00e+5±n/a nM
Citation Sardon, TCottin, TXu, JGiannis, AVernos, I Development and biological evaluation of a novel aurora A kinase inhibitor. Chembiochem10:464-78 (2009) 
 
Epidermal growth factor receptor
Name:Epidermal growth factor receptor
Type:Receptor Kinase Domain
Mol. Mass.:134279.59
Organism:Homo sapiens (Human)
Description:P00533
Residue:1210
BDBM84649
NameBDBM84649
Synonyms:TC-28
TypeSmall organic molecule
Emp. Form.C18H17N3O2
Mol. Mass.307.3465
SMILESCC(C)Nc1nc(nc2ccc(cc12)C#CCO)-c1ccco1