Reaction Details
TargetProgonadoliberin-1
LigandBDBM84712
Substrate/Competitorn/a
Ki 0.21±n/a nM
CommentsPDSP_17
Citation Haviv, FFitzpatrick, TDSwenson, RENichols, CJMort, NABush, ENDiaz, GBammert, GNguyen, ARhutasel, NS Effect of N-methyl substitution of the peptide bonds in luteinizing hormone-releasing hormone agonists. J Med Chem36:363-9 (1993) 
 
Progonadoliberin-1
Name:Progonadoliberin-1
Type:Enzyme Catalytic Domain
Mol. Mass.:10497.39
Organism:RAT
Description:Luteinizing Hormone-Releasing Hormone LHRH 0 RAT::P07490
Residue:92
BDBM84712
NameBDBM84712
Synonyms:deslorelin 2NMePhe | deslorelin 2Phe
TypeSmall organic molecule
Emp. Form.C68H87N15O12
Mol. Mass.1306.5117
SMILESCCNC(=O)[C@@H]1CCCN1C(=O)[C@H](CCCN=C(N)N)NC(=O)[C@H](CC(C)C)NC(=O)[C@@H](Cc1c[nH]c2ccccc12)NC(=O)[C@H](Cc1ccc(O)cc1)NC(=O)[C@H](CO)NC(=O)[C@H](Cc1c[nH]c2ccccc12)NC(=O)[C@H](Cc1ccccc1)N(C)C(=O)[C@@H]1CCC(=O)N1