Reaction Details
TargetProgonadoliberin-1
LigandBDBM84713
Substrate/Competitorn/a
Ki 0.04±n/a nM
CommentsPDSP_73
Citation Haviv, FFitzpatrick, TDSwenson, RENichols, CJMort, NABush, ENDiaz, GBammert, GNguyen, ARhutasel, NS Effect of N-methyl substitution of the peptide bonds in luteinizing hormone-releasing hormone agonists. J Med Chem36:363-9 (1993) 
 
Progonadoliberin-1
Name:Progonadoliberin-1
Type:Enzyme Catalytic Domain
Mol. Mass.:10497.39
Organism:RAT
Description:Luteinizing Hormone-Releasing Hormone LHRH 0 RAT::P07490
Residue:92
BDBM84713
NameBDBM84713
Synonyms:nafarelin 4NMeSer
TypeSmall organic molecule
Emp. Form.C67H85N17O13
Mol. Mass.1336.4979
SMILESCC(C)C[C@H](NC(=O)[C@@H](Cc1ccc2ccccc2c1)NC(=O)[C@H](Cc1ccc(O)cc1)NC(=O)[C@H](CO)N(C)C(=O)[C@H](Cc1c[nH]c2ccccc12)NC(=O)[C@H](Cc1cnc[nH]1)NC(=O)[C@@H]1CCC(=O)N1)C(=O)N[C@@H](CCCN=C(N)N)C(=O)N1CCC[C@H]1C(=O)NCC(N)=O