Reaction Details
Target5-hydroxytryptamine receptor 1E
LigandBDBM78940
Substrate/Competitorn/a
Ki 200±n/a nM
CommentsPDSP_1219
Citation Lovenberg, TWErlander, MGBaron, BMRacke, MSlone, ALSiegel, BWCraft, CMBurns, JEDanielson, PESutcliffe, JG Molecular cloning and functional expression of 5-HT1E-like rat and human 5-hydroxytryptamine receptor genes. Proc Natl Acad Sci U S A90:2184-8 (1993) 
 
5-hydroxytryptamine receptor 1E
Name:5-hydroxytryptamine receptor 1E
Type:Enzyme Catalytic Domain
Mol. Mass.:41709.22
Organism:RAT
Description:5-HT1E HTR1E RAT::G5B6Z9
Residue:365
BDBM78940
NameBDBM78940
Synonyms:METHIOTHEPIN Methiothepin mesylate salt cid_3039995 methanesulfonic acid;1-methyl-4-(3-methylsulfanyl-5,6-dihydrobenzo[b][1]benzothiepin-5-yl)piperazine | methanesulfonic acid;1-methyl-4-[3-(methylthio)-5,6-dihydrobenzo[b][1]benzothiepin-5-yl]piperazine
TypeSmall organic molecule
Emp. Form.C20H24N2S2
Mol. Mass.356.548
SMILESCSc1ccc2Sc3ccccc3CC(N3CCN(C)CC3)c2c1