Reaction Details
TargetGamma-aminobutyric acid receptor subunit alpha-5
LigandBDBM50243981
Substrate/Competitorn/a
Ki 76.4±n/a nM
CommentsPDSP_351
Citation Hadingham, KLWingrove, PLe Bourdelles, BPalmer, KJRagan, CIWhiting, PJ Cloning of cDNA sequences encoding human alpha 2 and alpha 3 gamma-aminobutyric acidA receptor subunits and characterization of the benzodiazepine pharmacology of recombinant alpha 1-, alpha 2-, alpha 3-, and alpha 5-containing human gamma-aminobutyric acidA receptors. Mol Pharmacol43:970-5 (1993) Gamma-aminobutyric acid receptor subunit alpha-5
Name:Gamma-aminobutyric acid receptor subunit alpha-5
Type:Enzyme
Mol. Mass.:52160.59
Organism:Homo sapiens (Human)
Description:P31644
Residue:462
BDBM50243981
NameBDBM50243981
Synonyms:Beta CCM Methyl Beta-carboline-3 carboxylate | methyl 9H-pyrido[3,4-b]indole-3-carboxylate
TypeSmall organic molecule
Emp. Form.C13H10N2O2
Mol. Mass.226.2307
SMILESCOC(=O)c1cc2c(cn1)[nH]c1ccccc21