Reaction Details
Target5-hydroxytryptamine receptor 7
LigandBDBM50028421
Substrate/Competitorn/a
Ki 1.01±n/a nM
CommentsPDSP_1453
Citation Shen, YMonsma, FJMetcalf, MAJose, PAHamblin, MWSibley, DR Molecular cloning and expression of a 5-hydroxytryptamine7 serotonin receptor subtype. J Biol Chem268:18200-4 (1993) 5-hydroxytryptamine receptor 7
Name:5-hydroxytryptamine receptor 7
Type:G Protein-Coupled Receptor (GPCR)
Mol. Mass.:49852.62
Organism:Rattus norvegicus (rat)
Description:Rat cloned 5-HT7R.
Residue:448
BDBM50028421
NameBDBM50028421
Synonyms:9-Methylsulfanylmethyl-7-propyl-4,6,6a,7,8,9,10,10a-octahydro-indolo[4,3-fg]quinoline; compound with methanesulfonic acid LY-127809 Pergolide | Permax
TypeSmall organic molecule
Emp. Form.C19H26N2S
Mol. Mass.314.488
SMILESCCCN1C[C@H](CSC)C[C@H]2[C@H]1Cc1c[nH]c3cccc2c13