Reaction Details
Target5-hydroxytryptamine receptor 7
LigandBDBM50019443
Substrate/Competitorn/a
Ki 1000±n/a nM
CommentsPDSP_1495
Citation Shen, YMonsma, FJMetcalf, MAJose, PAHamblin, MWSibley, DR Molecular cloning and expression of a 5-hydroxytryptamine7 serotonin receptor subtype. J Biol Chem268:18200-4 (1993) 5-hydroxytryptamine receptor 7
Name:5-hydroxytryptamine receptor 7
Type:G Protein-Coupled Receptor (GPCR)
Mol. Mass.:49852.62
Organism:Rattus norvegicus (rat)
Description:Rat cloned 5-HT7R.
Residue:448
BDBM50019443
NameBDBM50019443
Synonyms:1-(1H-Indol-4-yloxy)-3-isopropylamino-propan-2-ol 1-(1H-Indol-4-yloxy)-3-isopropylamino-propan-2-ol(pindolol) LB-46 PINDOLOL,(-) VISKAZIDE | VISKEN
TypeSmall organic molecule
Emp. Form.C14H20N2O2
Mol. Mass.248.3208
SMILESCC(C)NCC(O)COc1cccc2[nH]ccc12