Reaction Details
Target5-hydroxytryptamine receptor 7
LigandBDBM50024210
Substrate/Competitorn/a
Ki 32.8±n/a nM
CommentsPDSP_1920
Citation Shen, YMonsma, FJMetcalf, MAJose, PAHamblin, MWSibley, DR Molecular cloning and expression of a 5-hydroxytryptamine7 serotonin receptor subtype. J Biol Chem268:18200-4 (1993) 5-hydroxytryptamine receptor 7
Name:5-hydroxytryptamine receptor 7
Type:G Protein-Coupled Receptor (GPCR)
Mol. Mass.:49852.62
Organism:Rattus norvegicus (rat)
Description:Rat cloned 5-HT7R.
Residue:448
BDBM50024210
NameBDBM50024210
Synonyms:1H-indole-3-ethanamine 2-(3-indolyl)ethylamine tryptamine
TypeSmall organic molecule
Emp. Form.C10H12N2
Mol. Mass.160.2157
SMILESNCCc1c[nH]c2ccccc12