Reaction Details
Target5-hydroxytryptamine receptor 6
LigandBDBM82087
Substrate/Competitorn/a
Ki 6.3±n/a nM
CommentsPDSP_172
Citation Plassat, JLAmlaiky, NHen, R Molecular cloning of a mammalian serotonin receptor that activates adenylate cyclase. Mol Pharmacol44:229-36 (1993) 5-hydroxytryptamine receptor 6
Name:5-hydroxytryptamine receptor 6
Type:Enzyme Catalytic Domain
Mol. Mass.:47012.98
Organism:MOUSE
Description:5-HT6 HTR6 MOUSE::Q9R1C8
Residue:440
BDBM82087
NameBDBM82087
Synonyms:2-(5-methoxy-1H-indol-3-yl)ethanamine 5-Methoxytryptamine hydrochloride tryptamine, 5-Methoxy
TypeSmall organic molecule
Emp. Form.C11H14N2O
Mol. Mass.190.2417
SMILESCOc1ccc2[nH]cc(CCN)c2c1