Reaction Details
TargetSubstance-P receptor
LigandBDBM50000041
Substrate/Competitorn/a
Meas. Tech.ChEMBL_205879 (CHEMBL813940)
Ki 0.480000±n/a nM
Citation Desai, MCLefkowitz, SLThadeio, PFLongo, KPSnider, RM Discovery of a potent substance P antagonist: recognition of the key molecular determinant. J Med Chem35:4911-3 (1993) Substance-P receptor
Name:Substance-P receptor
Type:G Protein-Coupled Receptor (GPCR)
Mol. Mass.:46254.43
Organism:Homo sapiens (Human)
Description:P25103
Residue:407
BDBM50000041
NameBDBM50000041
Synonyms:(+) (2-Methoxy-benzyl)-(2-phenyl-piperidin-3-yl)-amine (+/-)(2-Methoxy-benzyl)-(2-phenyl-piperidin-3-yl)-amine (-)-(2-Methoxy-benzyl)-(2-phenyl-piperidin-3-yl)-amine (2-Methoxy-benzyl)-((2S,3S)-2-phenyl-piperidin-3-yl)-amine (2S,3S)-3-(2-Methoxy-benzyloxy)-2-phenyl-piperidine CHEMBL2114310 CP 99994 Tritiated-(2-Methoxy-benzyl)-(2-phenyl-piperidin-3-yl)-amine
TypeSmall organic molecule
Emp. Form.C19H24N2O
Mol. Mass.296.4067
SMILESCOc1ccccc1CN[C@H]1CCCN[C@H]1c1ccccc1