Reaction Details
TargetCytochrome P450 3A4
LigandBDBM50239250
Substrate/Competitorn/a
Meas. Tech.ChEMBL_1665797 (CHEMBL4015593)
IC50 73±n/a nM
Citation Yeung, KSBeno, BRParcella, KBender, JAGrant-Young, KANickel, AGunaga, PAnjanappa, PBora, ROSelvakumar, KRigat, KWang, YKLiu, MLemm, JMosure, KSheriff, SWan, CWitmer, MKish, KHanumegowda, UZhuo, XShu, YZParker, DHaskell, RNg, AGao, QColston, ERaybon, JGrasela, DMSantone, KGao, MMeanwell, NASinz, MSoars, MGKnipe, JORoberts, SBKadow, JF Discovery of a Hepatitis C Virus NS5B Replicase Palm Site Allosteric Inhibitor (BMS-929075) Advanced to Phase 1 Clinical Studies. J Med Chem60:4369-4385 (2017) 
 
Cytochrome P450 3A4
Name:Cytochrome P450 3A4
Type:Enzyme
Mol. Mass.:57349.57
Organism:Homo sapiens (Human)
Description:n/a
Residue:503
BDBM50239250
NameBDBM50239250
Synonyms:CHEMBL4086080
TypeSmall organic molecule
Emp. Form.C32H26FN3O3
Mol. Mass.519.5655
SMILESCNC(=O)c1c(oc2ccc(cc12)-c1cc(ccc1C)C(=O)NC1(CC1)c1ccncc1)-c1ccc(F)cc1