Reaction Details
TargetPotassium voltage-gated channel subfamily H member 2
LigandBDBM50239252
Substrate/Competitorn/a
Meas. Tech.ChEMBL_1665800 (CHEMBL4015596)
IC50 5800±n/a nM
Citation Yeung, KSBeno, BRParcella, KBender, JAGrant-Young, KANickel, AGunaga, PAnjanappa, PBora, ROSelvakumar, KRigat, KWang, YKLiu, MLemm, JMosure, KSheriff, SWan, CWitmer, MKish, KHanumegowda, UZhuo, XShu, YZParker, DHaskell, RNg, AGao, QColston, ERaybon, JGrasela, DMSantone, KGao, MMeanwell, NASinz, MSoars, MGKnipe, JORoberts, SBKadow, JF Discovery of a Hepatitis C Virus NS5B Replicase Palm Site Allosteric Inhibitor (BMS-929075) Advanced to Phase 1 Clinical Studies. J Med Chem60:4369-4385 (2017) 
 
Potassium voltage-gated channel subfamily H member 2
Name:Potassium voltage-gated channel subfamily H member 2
Type:Multi-pass membrane protein
Mol. Mass.:126672.65
Organism:Homo sapiens (Human)
Description:Q12809
Residue:1159
BDBM50239252
NameBDBM50239252
Synonyms:CHEMBL4078188
TypeSmall organic molecule
Emp. Form.C32H26FN3O3
Mol. Mass.519.5655
SMILESCNC(=O)c1c(oc2ccc(cc12)-c1cc(ccc1C)C(=O)NC1(CC1)c1ccccn1)-c1ccc(F)cc1