Reaction Details
TargetPotassium-transporting ATPase alpha chain 1
LigandBDBM50000222
Substrate/Competitorn/a
Meas. Tech.ChEBML_76079
IC50 4000±n/a nM
Citation Weidmann, KHerling, AWLang, HJScheunemann, KHRippel, RNimmesgern, HScholl, TBickel, MMetzger, H 2-[(2-pyridylmethyl)sulfinyl]-1H-thieno[3,4-d]imidazoles. A novel class of gastric H+/K(+)-ATPase inhibitors. J Med Chem35:438-50 (1992) Potassium-transporting ATPase alpha chain 1
Name:Potassium-transporting ATPase alpha chain 1
Type:Enzyme
Mol. Mass.:114279.23
Organism:Sus scrofa (Pig)
Description:P19156
Residue:1034
BDBM50000222
NameBDBM50000222
Synonyms:2-[3-Methoxy-4-(2,2,2-trifluoro-ethoxy)-pyridin-2-ylmethanesulfinyl]-3H-thieno[3,4-d]imidazole | CHEMBL139225
TypeSmall organic molecule
Emp. Form.C14H12F3N3O3S2
Mol. Mass.391.389
SMILESCOc1c(OCC(F)(F)F)ccnc1CS(=O)c1nc2cscc2[nH]1