Reaction Details
TargetKappa-type opioid receptor
LigandBDBM50000275
Substrate/Competitorn/a
Meas. Tech.ChEMBL_220946 (CHEMBL824621)
IC50 46±n/a nM
Citation Scopes, DIHayes, NFBays, DEBelton, DBrain, JBrown, DSJudd, DBMcElroy, ABMeerholz, CANaylor, A New kappa-receptor agonists based upon a 2-[(alkylamino)methyl]piperidine nucleus. J Med Chem35:490-501 (1992) Kappa-type opioid receptor
Name:Kappa-type opioid receptor
Type:G Protein-Coupled Receptor (GPCR)
Mol. Mass.:42648.76
Organism:Homo sapiens (Human)
Description:P41145
Residue:380
BDBM50000275
NameBDBM50000275
Synonyms:1-[2-(3,4-Dichloro-phenyl)-acetyl]-2-pyrrolidin-1-ylmethyl-piperidin-4-one | CHEMBL146884
TypeSmall organic molecule
Emp. Form.C18H22Cl2N2O2
Mol. Mass.369.285
SMILESClc1ccc(CC(=O)N2CCC(=O)CC2CN2CCCC2)cc1Cl