Reaction Details
TargetKappa-type opioid receptor
LigandBDBM50000290
Substrate/Competitorn/a
Meas. Tech.ChEMBL_220946 (CHEMBL824621)
IC50 1400±n/a nM
Citation Scopes, DIHayes, NFBays, DEBelton, DBrain, JBrown, DSJudd, DBMcElroy, ABMeerholz, CANaylor, A New kappa-receptor agonists based upon a 2-[(alkylamino)methyl]piperidine nucleus. J Med Chem35:490-501 (1992) Kappa-type opioid receptor
Name:Kappa-type opioid receptor
Type:G Protein-Coupled Receptor (GPCR)
Mol. Mass.:42648.76
Organism:Homo sapiens (Human)
Description:P41145
Residue:380
BDBM50000290
NameBDBM50000290
Synonyms:2-(3,4-Dichloro-phenyl)-1-(4-hydroxy-2-pyrrolidin-1-ylmethyl-piperidin-1-yl)-ethanone | CHEMBL345269
TypeSmall organic molecule
Emp. Form.C18H24Cl2N2O2
Mol. Mass.371.301
SMILESO[C@H]1CCN([C@H](CN2CCCC2)C1)C(=O)Cc1ccc(Cl)c(Cl)c1