Reaction Details
TargetCarbonic anhydrase 1
LigandBDBM50239273
Substrate/Competitorn/a
Meas. Tech.ChEMBL_1665867 (CHEMBL4015663)
Ki 39±n/a nM
Citation Bruno, EBuemi, MRDi Fiore, ADe Luca, LFerro, SAngeli, ACirilli, RSadutto, DAlterio, VMonti, SMSupuran, CTDe Simone, GGitto, R Probing Molecular Interactions between Human Carbonic Anhydrases (hCAs) and a Novel Class of Benzenesulfonamides. J Med Chem60:4316-4326 (2017) 
 
Carbonic anhydrase 1
Name:Carbonic anhydrase 1
Type:Enzyme
Mol. Mass.:28873.37
Organism:Homo sapiens (Human)
Description:P00915
Residue:261
BDBM50239273
NameBDBM50239273
Synonyms:CHEMBL4062013
TypeSmall organic molecule
Emp. Form.C24H23BrN2O5S
Mol. Mass.531.419
SMILESCOc1cc2CCN(C(c3ccc(Br)cc3)c2cc1OC)C(=O)c1ccc(cc1)S(N)(=O)=O