Reaction Details
TargetCarbonic anhydrase 9
LigandBDBM50239280
Substrate/Competitorn/a
Meas. Tech.ChEMBL_1665870 (CHEMBL4015666)
Ki 9.1±n/a nM
Citation Bruno, EBuemi, MRDi Fiore, ADe Luca, LFerro, SAngeli, ACirilli, RSadutto, DAlterio, VMonti, SMSupuran, CTDe Simone, GGitto, R Probing Molecular Interactions between Human Carbonic Anhydrases (hCAs) and a Novel Class of Benzenesulfonamides. J Med Chem60:4316-4326 (2017) 
 
Carbonic anhydrase 9
Name:Carbonic anhydrase 9
Type:Enzyme
Mol. Mass.:49669.03
Organism:Homo sapiens (Human)
Description:Catalytic domain of human cloned isozyme was used in the assay
Residue:459
BDBM50239280
NameBDBM50239280
Synonyms:CHEMBL4071251
TypeSmall organic molecule
Emp. Form.C24H23FN2O5S
Mol. Mass.470.513
SMILESCOc1cc2CCN(C(c3ccc(F)cc3)c2cc1OC)C(=O)c1ccc(cc1)S(N)(=O)=O