Reaction Details
TargetCarbonic anhydrase 1
LigandBDBM50239278
Substrate/Competitorn/a
Meas. Tech.ChEMBL_1665867 (CHEMBL4015663)
Ki 9.3±n/a nM
Citation Bruno, EBuemi, MRDi Fiore, ADe Luca, LFerro, SAngeli, ACirilli, RSadutto, DAlterio, VMonti, SMSupuran, CTDe Simone, GGitto, R Probing Molecular Interactions between Human Carbonic Anhydrases (hCAs) and a Novel Class of Benzenesulfonamides. J Med Chem60:4316-4326 (2017) 
 
Carbonic anhydrase 1
Name:Carbonic anhydrase 1
Type:Enzyme
Mol. Mass.:28873.37
Organism:Homo sapiens (Human)
Description:P00915
Residue:261
BDBM50239278
NameBDBM50239278
Synonyms:CHEMBL4095957
TypeSmall organic molecule
Emp. Form.C22H20N2O5S
Mol. Mass.424.47
SMILESNS(=O)(=O)c1ccc(cc1)C(=O)N1CCc2cc(O)c(O)cc2[C@@H]1c1ccccc1