Reaction Details
TargetCarbonic anhydrase 2
LigandBDBM50239281
Substrate/Competitorn/a
Meas. Tech.ChEMBL_1665868 (CHEMBL4015664)
Ki 3.5±n/a nM
Citation Bruno, EBuemi, MRDi Fiore, ADe Luca, LFerro, SAngeli, ACirilli, RSadutto, DAlterio, VMonti, SMSupuran, CTDe Simone, GGitto, R Probing Molecular Interactions between Human Carbonic Anhydrases (hCAs) and a Novel Class of Benzenesulfonamides. J Med Chem60:4316-4326 (2017) 
 
Carbonic anhydrase 2
Name:Carbonic anhydrase 2
Type:Enzyme
Mol. Mass.:29250.71
Organism:Homo sapiens (Human)
Description:P00918
Residue:260
BDBM50239281
NameBDBM50239281
Synonyms:CHEMBL4100218
TypeSmall organic molecule
Emp. Form.C22H20N2O5S
Mol. Mass.424.47
SMILESNS(=O)(=O)c1ccc(cc1)C(=O)N1CCc2cc(O)c(O)cc2C1c1ccccc1