Reaction Details
TargetCarbonic anhydrase 2
LigandBDBM50239282
Substrate/Competitorn/a
Meas. Tech.ChEMBL_1665868 (CHEMBL4015664)
Ki 0.280000±n/a nM
Citation Bruno, EBuemi, MRDi Fiore, ADe Luca, LFerro, SAngeli, ACirilli, RSadutto, DAlterio, VMonti, SMSupuran, CTDe Simone, GGitto, R Probing Molecular Interactions between Human Carbonic Anhydrases (hCAs) and a Novel Class of Benzenesulfonamides. J Med Chem60:4316-4326 (2017) 
 
Carbonic anhydrase 2
Name:Carbonic anhydrase 2
Type:Enzyme
Mol. Mass.:29250.71
Organism:Homo sapiens (Human)
Description:P00918
Residue:260
BDBM50239282
NameBDBM50239282
Synonyms:CHEMBL4099267
TypeSmall organic molecule
Emp. Form.C22H19BrN2O5S
Mol. Mass.503.366
SMILESNS(=O)(=O)c1ccc(cc1)C(=O)N1CCc2cc(O)c(O)cc2C1c1ccc(Br)cc1