Reaction Details
TargetCarbonic anhydrase 7
LigandBDBM50239271
Substrate/Competitorn/a
Meas. Tech.ChEMBL_1665869 (CHEMBL4015665)
Ki 7.3±n/a nM
Citation Bruno, EBuemi, MRDi Fiore, ADe Luca, LFerro, SAngeli, ACirilli, RSadutto, DAlterio, VMonti, SMSupuran, CTDe Simone, GGitto, R Probing Molecular Interactions between Human Carbonic Anhydrases (hCAs) and a Novel Class of Benzenesulfonamides. J Med Chem60:4316-4326 (2017) 
 
Carbonic anhydrase 7
Name:Carbonic anhydrase 7
Type:Enzyme
Mol. Mass.:29664.11
Organism:Homo sapiens (Human)
Description:Human cloned isozyme.
Residue:264
BDBM50239271
NameBDBM50239271
Synonyms:CHEMBL4069601
TypeSmall organic molecule
Emp. Form.C24H24N2O5S
Mol. Mass.452.523
SMILESCOc1cc2CCN(C(c3ccccc3)c2cc1OC)C(=O)c1ccc(cc1)S(N)(=O)=O